BDBM69315 6-ketostearic acid::6-oxidanylideneoctadecanoic acid::6-oxooctadecanoic acid::MLS001049131::SMR000386957::cid_361939
SMILES CCCCCCCCCCCCC(=O)CCCCC(O)=O
InChI Key InChIKey=QZLYZQUYIQGGOQ-UHFFFAOYSA-N
Data  1 EC50
  Tab Delimited (TSV)   2D SDfile   Computed 3D by Vconf -m prep SDfile
Find this compound or compounds like it in BindingDB:
Activity Spreadsheet -- Enzyme Inhibition Constant Data from BindingDB
Found 1 hit for monomerid = 69315
TargetGlycogen synthase kinase-3 beta(Homo sapiens (Human))
Broad Institute
Curated by PubChem BioAssay
LigandPNGBDBM69315(6-ketostearic acid | 6-oxidanylideneoctadecanoic a...)
Affinity DataEC50: >3.00E+5nM. Assay description: Keywords: GSK3beta, dose response, kinase, inhibition, HTS Assay Overview: The glycogen synthase kinase-3 beta (GSK-3b) is a known master regulator f...
In DepthDetails PCBioAssay