BDBM70191 3-[3-(4-tert-butylphenyl)-1,2,4-oxadiazol-5-yl]-N-(2-pyridinyl)propanamide::3-[3-(4-tert-butylphenyl)-1,2,4-oxadiazol-5-yl]-N-(2-pyridyl)propionamide::3-[3-(4-tert-butylphenyl)-1,2,4-oxadiazol-5-yl]-N-pyridin-2-yl-propanamide::3-[3-(4-tert-butylphenyl)-1,2,4-oxadiazol-5-yl]-N-pyridin-2-ylpropanamide::SR-03000001167::SR-03000001167-1::cid_44631079
SMILES CC(C)(C)c1ccc(cc1)-c1noc(CCC(=O)Nc2ccccn2)n1
InChI Key InChIKey=LILIKSQZMYEVSH-UHFFFAOYSA-N
Data  1 IC50
  Tab Delimited (TSV)   2D SDfile   Computed 3D by Vconf -m prep SDfile
Find this compound or compounds like it in BindingDB:
Activity Spreadsheet -- Enzyme Inhibition Constant Data from BindingDB
Found 1 hit for monomerid = 70191
TargetKrueppel-like factor 5(Homo sapiens (Human))
The Scripps Research Institute Molecular Screening Center
Curated by PubChem BioAssay
LigandPNGBDBM70191(3-[3-(4-tert-butylphenyl)-1,2,4-oxadiazol-5-yl]-N-...)
Affinity DataIC50:  159nM. Assay description: Source (MLPCN Center Name): The Scripps Research Institute Molecular Screening Center Affiliation: The Scripps Research Institute, TSRI Assay Provide...
In DepthDetails PCBioAssay