BDBM70235 4-[[2-methoxy-4-[(E)-(2-naphthalenylsulfonylhydrazinylidene)methyl]phenoxy]methyl]benzoic acid::4-[[2-methoxy-4-[(E)-(2-naphthylsulfonylhydrazono)methyl]phenoxy]methyl]benzoic acid::4-[[2-methoxy-4-[(E)-(naphthalen-2-ylsulfonylhydrazinylidene)methyl]phenoxy]methyl]benzoic acid::MLS-0298745.0001::cid_6875286
SMILES COc1cc(\C=N\NS(=O)(=O)c2ccc3ccccc3c2)ccc1OCc1ccc(cc1)C(O)=O
InChI Key InChIKey=GDELURXDWOVYLW-JVWAILMASA-N
Data  2 IC50
  Tab Delimited (TSV)   2D SDfile   Computed 3D by Vconf -m prep SDfile
Find this compound or compounds like it in BindingDB:
Activity Spreadsheet -- Enzyme Inhibition Constant Data from BindingDB
Found 2 hits for monomerid = 70235
TargetEnvelope glycoprotein gp160(Human immunodeficiency virus 1)
Burnham Center For Chemical Genomics
Curated by PubChem BioAssay
LigandPNGBDBM70235(4-[[2-methoxy-4-[(E)-(2-naphthalenylsulfonylhydraz...)
Affinity DataIC50:  3.10E+4nM. Assay description: Data Source: Burnham Center for Chemical Genomics (BCCG) Source Affiliation: Sanford-Burnham Medical Research Institute (SBMRI, San Diego, CA) Networ...
In DepthDetails PCBioAssay
TargetEnvelope glycoprotein gp160(Human immunodeficiency virus 1)
Burnham Center For Chemical Genomics
Curated by PubChem BioAssay
LigandPNGBDBM70235(4-[[2-methoxy-4-[(E)-(2-naphthalenylsulfonylhydraz...)
Affinity DataIC50:  7.76E+3nM. Assay description: Data Source: Burnham Center for Chemical Genomics (BCCG) Source Affiliation: Sanford-Burnham Medical Research Institute (SBMRI, San Diego, CA) Networ...
In DepthDetails PCBioAssay