BDBM70252 3-({Cyclohexyl-[1-(1-furan-2-ylmethyl-1H-tetrazol-5-yl)-propyl]-amino}-methyl)-6-methoxy-1H-quinolin-2-one::3-[[cyclohexyl-[1-[1-(2-furanylmethyl)-5-tetrazolyl]propyl]amino]methyl]-6-methoxy-1H-quinolin-2-one::3-[[cyclohexyl-[1-[1-(2-furfuryl)tetrazol-5-yl]propyl]amino]methyl]-6-methoxy-carbostyril::3-[[cyclohexyl-[1-[1-(furan-2-ylmethyl)-1,2,3,4-tetrazol-5-yl]propyl]amino]methyl]-6-methoxy-1H-quinolin-2-one::3-[[cyclohexyl-[1-[1-(furan-2-ylmethyl)tetrazol-5-yl]propyl]amino]methyl]-6-methoxy-1H-quinolin-2-one::MLS000032291::SMR000004381::cid_646746
SMILES CCC(N(Cc1cc2cc(OC)ccc2[nH]c1=O)C1CCCCC1)c1nnnn1Cc1ccco1
InChI Key InChIKey=JDCGBNCPEVJAOY-UHFFFAOYSA-N
Data  3 EC50
  Tab Delimited (TSV)   2D SDfile   Computed 3D by Vconf -m prep SDfile
Find this compound or compounds like it in BindingDB:
Activity Spreadsheet -- Enzyme Inhibition Constant Data from BindingDB
Found 3 hits for monomerid = 70252
TargetProtein RecA(Mycobacterium tuberculosis H37Rv)
Broad Institute
Curated by PubChem BioAssay
LigandPNGBDBM70252(3-({Cyclohexyl-[1-(1-furan-2-ylmethyl-1H-tetrazol-...)
Affinity DataEC50:  5.71E+4nM. Assay description: Keywords: GFP, refolding, reducing reagent, GFP fluorescence Assay Overview: M. tuberculosis harbors three inteins, which interrupt the DnaB, RecA, a...
In DepthDetails PCBioAssay
TargetProtein RecA(Mycobacterium tuberculosis H37Rv)
Broad Institute
Curated by PubChem BioAssay
LigandPNGBDBM70252(3-({Cyclohexyl-[1-(1-furan-2-ylmethyl-1H-tetrazol-...)
Affinity DataEC50:  4.02E+4nM. Assay description: Keywords: GFP-RecA intein, protein splicing, refolding, reducing reagent, GFP fluorescence Assay Overview: M. tuberculosis harbors three inteins, whi...
In DepthDetails PCBioAssay
TargetHeat shock factor protein 1(Mus musculus)
Broad Institute
Curated by PubChem BioAssay
LigandPNGBDBM70252(3-({Cyclohexyl-[1-(1-furan-2-ylmethyl-1H-tetrazol-...)
Affinity DataEC50:  1.07E+4nM. Assay description: Keywords: Heat Shock Factor-1 (HSF-1), Stress Response, MG132, NIH3T3, Luminescence Assay Overview: Confirmation testing of small molecules identifie...
In DepthDetails PCBioAssay