BDBM70269 6-Amino-4-(2,5-dimethoxy-phenyl)-3-methyl-1-p-tolyl-1,4-dihydro-pyrano[2,3-c]pyrazole-5-carbonitrile::6-amino-4-(2,5-dimethoxyphenyl)-3-methyl-1-(4-methylphenyl)-4H-pyrano[2,3-c]pyrazole-5-carbonitrile::6-amino-4-(2,5-dimethoxyphenyl)-3-methyl-1-(p-tolyl)-4H-pyrano[2,3-c]pyrazole-5-carbonitrile::6-azanyl-4-(2,5-dimethoxyphenyl)-3-methyl-1-(4-methylphenyl)-4H-pyrano[2,3-c]pyrazole-5-carbonitrile::MLS000027151::SMR000009987::cid_651315
SMILES COc1ccc(OC)c(c1)C1C(C#N)C(=N)Oc2c1c(C)nn2-c1ccc(C)cc1
InChI Key InChIKey=CDRXZZRSXRDUPY-UHFFFAOYSA-N
Data  2 EC50
  Tab Delimited (TSV)   2D SDfile   Computed 3D by Vconf -m prep SDfile
Find this compound or compounds like it in BindingDB:
Activity Spreadsheet -- Enzyme Inhibition Constant Data from BindingDB
Found 2 hits for monomerid = 70269
TargetProtein RecA(Mycobacterium tuberculosis H37Rv)
Broad Institute
Curated by PubChem BioAssay
LigandPNGBDBM70269(6-Amino-4-(2,5-dimethoxy-phenyl)-3-methyl-1-p-toly...)
Affinity DataEC50:  4.91E+3nM. Assay description: Keywords: GFP-RecA intein, protein splicing, refolding, reducing reagent, GFP fluorescence Assay Overview: M. tuberculosis harbors three inteins, whi...
In DepthDetails PCBioAssay
TargetProtein RecA(Mycobacterium tuberculosis H37Rv)
Broad Institute
Curated by PubChem BioAssay
LigandPNGBDBM70269(6-Amino-4-(2,5-dimethoxy-phenyl)-3-methyl-1-p-toly...)
Affinity DataEC50:  2.94E+4nM. Assay description: Keywords: GFP, refolding, reducing reagent, GFP fluorescence Assay Overview: M. tuberculosis harbors three inteins, which interrupt the DnaB, RecA, a...
In DepthDetails PCBioAssay