BDBM70455 US9693997, 115
SMILES CN(C)C(=O)c1cccc(c1)-c1c(Cl)cc(Nc2n[nH]c(N)n2)cc1Cl
InChI Key InChIKey=UMHCKZCXFYTAAQ-UHFFFAOYSA-N
Data  2 EC50
  Tab Delimited (TSV)   2D SDfile   Computed 3D by Vconf -m prep SDfile
Find this compound or compounds like it in BindingDB:
Activity Spreadsheet -- Enzyme Inhibition Constant Data from BindingDB
Found 2 hits for monomerid = 70455
TargetGenome polyprotein(Hepatitis C virus (HCV))
Hoffmann-La Roche
US Patent
LigandPNGBDBM70455(US9693997, 115)
Affinity DataEC50:  7nM. Assay description: Plasmids expressing HCV E1 and E2 envelope proteins of GT1a H77 strain (Proc Natl Acad Sci USA 1997 94:8738-43) or GT1b Con1 strain (Science 1999 285...
In DepthDetails US Patent
TargetGenome polyprotein(Hepatitis C virus (HCV genotype 1a, isolate H))
Hoffmann-La Roche
US Patent
LigandPNGBDBM70455(US9693997, 115)
Affinity DataEC50:  107nM. Assay description: Plasmids expressing HCV E1 and E2 envelope proteins of GT1a H77 strain (Proc Natl Acad Sci USA 1997 94:8738-43) or GT1b Con1 strain (Science 1999 285...
In DepthDetails US Patent