BDBM70635 US9693997, 165
SMILES CC(C)(NS(=O)(=O)c1ccc(cc1)-c1c(Cl)cc(Nc2n[nH]c(N)n2)cc1C(F)(F)F)C(F)(F)F
InChI Key InChIKey=YWRIXCAQROLFPI-UHFFFAOYSA-N
Data  1 EC50
  Tab Delimited (TSV)   2D SDfile   Computed 3D by Vconf -m prep SDfile
Find this compound or compounds like it in BindingDB:
Activity Spreadsheet -- Enzyme Inhibition Constant Data from BindingDB
Found 1 hit for monomerid = 70635
TargetGenome polyprotein(Hepatitis C virus (HCV genotype 1a, isolate H))
Hoffmann-La Roche
US Patent
LigandPNGBDBM70635(US9693997, 165)
Affinity DataEC50:  9nM. Assay description: Plasmids expressing HCV E1 and E2 envelope proteins of GT1a H77 strain (Proc Natl Acad Sci USA 1997 94:8738-43) or GT1b Con1 strain (Science 1999 285...
In DepthDetails US Patent