BDBM70715 US9693997, 228
SMILES CC(C)S(=O)(=O)c1ccc(cc1)-c1c(Cl)cc(Nc2n[nH]c(N)n2)cc1C(F)(F)F
InChI Key InChIKey=DXMSNUJMQKMLSX-UHFFFAOYSA-N
Data  1 EC50
  Tab Delimited (TSV)   2D SDfile   Computed 3D by Vconf -m prep SDfile
Find this compound or compounds like it in BindingDB:
Activity Spreadsheet -- Enzyme Inhibition Constant Data from BindingDB
Found 1 hit for monomerid = 70715
TargetGenome polyprotein(Hepatitis C virus (HCV genotype 1a, isolate H))
Hoffmann-La Roche
US Patent
LigandPNGBDBM70715(US9693997, 228)
Affinity DataEC50:  42nM. Assay description: Plasmids expressing HCV E1 and E2 envelope proteins of GT1a H77 strain (Proc Natl Acad Sci USA 1997 94:8738-43) or GT1b Con1 strain (Science 1999 285...
Ligand InfoPC cidPC sid
In DepthDetails US Patent