BDBM70743 US9693997, 246
SMILES Nc1n[nH]c(Nc2cc(F)c(-c3ccc(cc3)C(F)(F)F)c(c2)C(F)(F)F)n1
InChI Key InChIKey=ICYLOPBMFRLIGD-UHFFFAOYSA-N
Data  1 EC50
  Tab Delimited (TSV)   2D SDfile   Computed 3D by Vconf -m prep SDfile
Find this compound or compounds like it in BindingDB:
Activity Spreadsheet -- Enzyme Inhibition Constant Data from BindingDB
Found 1 hit for monomerid = 70743
TargetGenome polyprotein(Hepatitis C virus (HCV genotype 1a, isolate H))
Hoffmann-La Roche
US Patent
LigandPNGBDBM70743(US9693997, 246)
Affinity DataEC50:  3.54E+3nM. Assay description: Plasmids expressing HCV E1 and E2 envelope proteins of GT1a H77 strain (Proc Natl Acad Sci USA 1997 94:8738-43) or GT1b Con1 strain (Science 1999 285...
Ligand InfoPC cidPC sid
In DepthDetails US Patent