BDBM7097 3-Aminopyrazole deriv. 7::CHEMBL190178::N-(5-Cyclopropyl-1H-pyrazol-3-yl)-2-oxo-2-phenylacetamide
SMILES O=C(Nc1cc(n[nH]1)C1CC1)C(=O)c1ccccc1
InChI Key InChIKey=GFPPHSHWJZFXOY-UHFFFAOYSA-N
Data  2 IC50
  Tab Delimited (TSV)   2D SDfile   Computed 3D by Vconf -m prep SDfile
Find this compound or compounds like it in BindingDB:
Activity Spreadsheet -- Enzyme Inhibition Constant Data from BindingDB
Found 2 hits for monomerid = 7097
TargetCyclin-dependent kinase 2(Homo sapiens (Human))
Institute Of Chemical Biology (Csir)
Curated by ChEMBL
LigandPNGBDBM7097(3-Aminopyrazole deriv. 7 | CHEMBL190178 | N-(5-Cyc...)
Affinity DataIC50:  2.60E+3nM. Assay description: Inhibition of CDK2/Cyclin A (unknown origin)
In DepthDetails ArticlePubMed
TargetCyclin-A2/Cyclin-dependent kinase 2(Homo sapiens (Human))
Nerviano Medical Sciences
LigandPNGBDBM7097(3-Aminopyrazole deriv. 7 | CHEMBL190178 | N-(5-Cyc...)
Affinity DataIC50:  2.60E+3nMpH: 7.4 T: 2°C. Assay description: The biochemical activity of compounds was determined by incubation with specific enzymes and substrates in the presence ATP/[gamma-33P] ATP. After in...
In DepthDetails ArticlePubMed