BDBM70992 US9546164, 142::US9694002, 142
SMILES CS(=O)(=O)NC(=O)c1cc(C2CC2)c(OCC2CN(C2)[C@@H](c2ccccc2)c2cc(Cl)cc(Cl)c2)cc1F
InChI Key InChIKey=AGUMLPYUAXPZOR-MHZLTWQESA-N
Data  2 IC50
  Tab Delimited (TSV)   2D SDfile   Computed 3D by Vconf -m prep SDfile
Find this compound or compounds like it in BindingDB:
Activity Spreadsheet -- Enzyme Inhibition Constant Data from BindingDB
Found 2 hits for monomerid = 70992
TargetSodium channel protein type 5 subunit alpha(Homo sapiens (Human))
Genentech
US Patent
LigandPNGBDBM70992(US9546164, 142 | US9694002, 142)
Affinity DataIC50:  6.57nMpH: 7.4 T: 2°C. Assay description: Radioligand Binding Studies: Saturation experiments. A representative compound of formula (I) having a methyl group was tritiated. Three tritiums wer...
In DepthDetails US Patent
TargetSodium channel protein type 1/10/11/2/3/4/5/8/9 subunit alpha(Homo sapiens (Human))
Genentech
US Patent
LigandPNGBDBM70992(US9546164, 142 | US9694002, 142)
Affinity DataIC50:  6.60nMpH: 7.4 T: 2°C. Assay description: Binding of this radioligand was preformed in 5 mL borosilicate glass test tubes at room temperature. Binding was initiated by adding membranes to inc...
In DepthDetails US Patent