BDBM71275 4-(2,6-dichlorobenzyl)-5-methyl-2,4-dihydro-3H-pyrazol-3-one::4-(2,6-dichlorobenzyl)-5-methyl-2-pyrazolin-3-one::4-[(2,6-dichlorophenyl)methyl]-3-methyl-1,4-dihydropyrazol-5-one::4-[[2,6-bis(chloranyl)phenyl]methyl]-3-methyl-1,4-dihydropyrazol-5-one::MLS001143366::SMR000473201::cid_2729945
SMILES Cc1[nH][nH]c(=O)c1Cc1c(Cl)cccc1Cl
InChI Key InChIKey=IFYULNNPBBMAFS-UHFFFAOYSA-N
Data  1 IC50
  Tab Delimited (TSV)   2D SDfile   Computed 3D by Vconf -m prep SDfile
Find this compound or compounds like it in BindingDB:
Activity Spreadsheet -- Enzyme Inhibition Constant Data from BindingDB
Found 1 hit for monomerid = 71275
TargetProtein RecA(Mycobacterium tuberculosis H37Rv)
Southern Research Specialized Biocontainment Screening Center
Curated by PubChem BioAssay
LigandPNGBDBM71275(4-(2,6-dichlorobenzyl)-5-methyl-2,4-dihydro-3H-pyr...)
Affinity DataIC50:  4.62E+4nM. Assay description: Southern Research's Specialized Biocontainment Screening Center (SRSBSC) Southern Research Institute (Birmingham, Alabama) NIH Molecular Librarie...
Ligand InfoPC cidPC sid
In DepthDetails PCBioAssay