BDBM71510 US9546164, 530::US9694002, 529::US9694002, 530
SMILES CC(C)(N1CCC[C@H](C1)Oc1cc(F)c(cc1C1CC1)C(N)=O)c1cccc(Cl)c1
InChI Key InChIKey=WGJKXBIAQQOYRR-GOSISDBHSA-N
Data  4 IC50
  Tab Delimited (TSV)   2D SDfile   Computed 3D by Vconf -m prep SDfile
Find this compound or compounds like it in BindingDB:
Activity Spreadsheet -- Enzyme Inhibition Constant Data from BindingDB
Found 4 hits for monomerid = 71510
TargetSodium channel protein type 1/10/11/2/3/4/5/8/9 subunit alpha(Homo sapiens (Human))
Genentech
US Patent
LigandPNGBDBM71510(US9546164, 530 | US9694002, 529 | US9694002, 530)
Affinity DataIC50:  2.40nMpH: 7.4 T: 2°C. Assay description: Binding of this radioligand was preformed in 5 mL borosilicate glass test tubes at room temperature. Binding was initiated by adding membranes to inc...
In DepthDetails US Patent
TargetSodium channel protein type 5 subunit alpha(Homo sapiens (Human))
Genentech
US Patent
LigandPNGBDBM71510(US9546164, 530 | US9694002, 529 | US9694002, 530)
Affinity DataIC50:  2.30nMpH: 7.4 T: 2°C. Assay description: Radioligand Binding Studies: Saturation experiments. A representative compound of formula (I) having a methyl group was tritiated. Three tritiums wer...
In DepthDetails US Patent
TargetSodium channel protein type 5 subunit alpha(Homo sapiens (Human))
Genentech
US Patent
LigandPNGBDBM71510(US9546164, 530 | US9694002, 529 | US9694002, 530)
Affinity DataIC50:  2.40nMpH: 7.4 T: 2°C. Assay description: Radioligand Binding Studies: Saturation experiments. A representative compound of formula (I) having a methyl group was tritiated. Three tritiums wer...
In DepthDetails US Patent
TargetSodium channel protein type 1/10/11/2/3/4/5/8/9 subunit alpha(Homo sapiens (Human))
Genentech
US Patent
LigandPNGBDBM71510(US9546164, 530 | US9694002, 529 | US9694002, 530)
Affinity DataIC50:  2.30nMpH: 7.4 T: 2°C. Assay description: Binding of this radioligand was preformed in 5 mL borosilicate glass test tubes at room temperature. Binding was initiated by adding membranes to inc...
In DepthDetails US Patent