BDBM71587 4-[(brosylamino)methyl]-N-(2-isoindolin-2-ylethyl)benzamide::4-[[(4-bromophenyl)sulfonylamino]methyl]-N-[2-(1,3-dihydroisoindol-2-yl)ethyl]benzamide::KSC-5-282B::KUC104168N::cid_44620898
SMILES Brc1ccc(cc1)S(=O)(=O)NCc1ccc(cc1)C(=O)NCCN1Cc2ccccc2C1
InChI Key InChIKey=KPGCCIDPBAMQAJ-UHFFFAOYSA-N
Data  4 IC50
  Tab Delimited (TSV)   2D SDfile   Computed 3D by Vconf -m prep SDfile
Find this compound or compounds like it in BindingDB:
Activity Spreadsheet -- Enzyme Inhibition Constant Data from BindingDB
Found 4 hits for monomerid = 71587
TargetKappa-type opioid receptor(Homo sapiens (Human))
Burnham Center For Chemical Genomics
Curated by PubChem BioAssay
LigandPNGBDBM71587(4-[(brosylamino)methyl]-N-(2-isoindolin-2-ylethyl)...)
Affinity DataIC50: >2.00E+4nM. Assay description: Data Source: Burnham Center for Chemical Genomics (BCCG) Source Affiliation: Burnham Institute for Medical Research (BIMR, La Jolla, CA) Network: NIH...
In DepthDetails PCBioAssay
TargetMu-type opioid receptor(Homo sapiens (Human))
Burnham Center For Chemical Genomics
Curated by PubChem BioAssay
LigandPNGBDBM71587(4-[(brosylamino)methyl]-N-(2-isoindolin-2-ylethyl)...)
Affinity DataIC50: >3.20E+4nM. Assay description: Data Source: Sanford-Burnham Center for Chemical Genomics (SBCCG) Source Affiliation: Sanford-Burnham Medical Research Institute (SBMRI, San Diego, C...
In DepthDetails PCBioAssay
TargetDelta-type opioid receptor(Homo sapiens (Human))
Burnham Center For Chemical Genomics
Curated by PubChem BioAssay
LigandPNGBDBM71587(4-[(brosylamino)methyl]-N-(2-isoindolin-2-ylethyl)...)
Affinity DataIC50: >3.20E+4nM. Assay description: Data Source: Sanford-Burnham Center for Chemical Genomics (SBCCG) Source Affiliation: Sanford-Burnham Medical Research Institute (SBMRI, San Diego, C...
In DepthDetails PCBioAssay
TargetKappa-type opioid receptor(Homo sapiens (Human))
Burnham Center For Chemical Genomics
Curated by PubChem BioAssay
LigandPNGBDBM71587(4-[(brosylamino)methyl]-N-(2-isoindolin-2-ylethyl)...)
Affinity DataIC50: >3.20E+4nM. Assay description: Data Source: Sanford-Burnham Center for Chemical Genomics (SBCCG) Source Affiliation: Sanford-Burnham Medical Research Institute (SBMRI, San Diego, C...
In DepthDetails PCBioAssay