BDBM71634 2-(4-morpholinyl)-N-(2-naphthalenyl)-N-phenylacetamide::2-Morpholin-4-yl-N-naphthalen-2-yl-N-phenyl-acetamide::2-morpholin-4-yl-N-naphthalen-2-yl-N-phenyl-ethanamide::2-morpholin-4-yl-N-naphthalen-2-yl-N-phenylacetamide::2-morpholino-N-(2-naphthyl)-N-phenyl-acetamide::MLS000032184::SMR000001565::cid_648283
SMILES O=C(CN1CCOCC1)N(c1ccccc1)c1ccc2ccccc2c1
InChI Key InChIKey=CXULPDNDZRAYLH-UHFFFAOYSA-N
Data  1 EC50
  Tab Delimited (TSV)   2D SDfile   Computed 3D by Vconf -m prep SDfile
Find this compound or compounds like it in BindingDB:
Activity Spreadsheet -- Enzyme Inhibition Constant Data from BindingDB
Found 1 hit for monomerid = 71634
TargetHeat shock factor protein 1(Mus musculus)
Broad Institute
Curated by PubChem BioAssay
LigandPNGBDBM71634(2-(4-morpholinyl)-N-(2-naphthalenyl)-N-phenylaceta...)
Affinity DataEC50: >2.60E+5nM. Assay description: Keywords: Heat Shock Factor-1 (HSF-1), Stress Response, MG132, NIH3T3, Luminescence Assay Overview: Confirmation testing of small molecules identifie...
In DepthDetails PCBioAssay