BDBM71643 2-Allylsulfanyl-4-(3-methoxy-phenyl)-6-oxo-1,4,5,6-tetrahydro-pyridine-3-carbonitrile::4-(3-methoxyphenyl)-2-oxidanylidene-6-prop-2-enylsulfanyl-3,4-dihydro-1H-pyridine-5-carbonitrile::4-(3-methoxyphenyl)-2-oxo-6-(prop-2-enylthio)-3,4-dihydro-1H-pyridine-5-carbonitrile::4-(3-methoxyphenyl)-2-oxo-6-prop-2-enylsulfanyl-3,4-dihydro-1H-pyridine-5-carbonitrile::6-(allylthio)-2-keto-4-(3-methoxyphenyl)-3,4-dihydro-1H-pyridine-5-carbonitrile::MLS000073432::SMR000009657::cid_649763
SMILES COc1cccc(c1)C1CC(=O)NC(SCC=C)=C1C#N
InChI Key InChIKey=JBLFBTHCFDQUOD-UHFFFAOYSA-N
Data  1 EC50
  Tab Delimited (TSV)   2D SDfile   Computed 3D by Vconf -m prep SDfile
Find this compound or compounds like it in BindingDB:
Activity Spreadsheet -- Enzyme Inhibition Constant Data from BindingDB
Found 1 hit for monomerid = 71643
TargetHeat shock factor protein 1(Mus musculus)
Broad Institute
Curated by PubChem BioAssay
LigandPNGBDBM71643(2-Allylsulfanyl-4-(3-methoxy-phenyl)-6-oxo-1,4,5,6...)
Affinity DataEC50: >2.60E+5nM. Assay description: Keywords: Heat Shock Factor-1 (HSF-1), Stress Response, MG132, NIH3T3, Luminescence Assay Overview: Confirmation testing of small molecules identifie...
In DepthDetails PCBioAssay