BDBM71655 1-(4-methylphenyl)-2-[5-[2-(1,2,3,4-tetrazol-1-yl)phenyl]-1,2,3,4-tetrazol-2-yl]ethanone::1-(4-methylphenyl)-2-[5-[2-(1-tetrazolyl)phenyl]-2-tetrazolyl]ethanone::1-(4-methylphenyl)-2-[5-[2-(tetrazol-1-yl)phenyl]tetrazol-2-yl]ethanone::1-(p-tolyl)-2-[5-[2-(tetrazol-1-yl)phenyl]tetrazol-2-yl]ethanone::2-[5-(2-Tetrazol-1-yl-phenyl)-tetrazol-2-yl]-1-p-tolyl-ethanone::MLS000072146::SMR000003815::cid_653727
SMILES Cc1ccc(cc1)C(=O)Cn1nnc(n1)-c1ccccc1-n1cnnn1
InChI Key InChIKey=KHIXKFJLGLCQKM-UHFFFAOYSA-N
Data  1 EC50
  Tab Delimited (TSV)   2D SDfile   Computed 3D by Vconf -m prep SDfile
Find this compound or compounds like it in BindingDB:
Activity Spreadsheet -- Enzyme Inhibition Constant Data from BindingDB
Found 1 hit for monomerid = 71655
TargetHeat shock factor protein 1(Mus musculus)
Broad Institute
Curated by PubChem BioAssay
LigandPNGBDBM71655(1-(4-methylphenyl)-2-[5-[2-(1,2,3,4-tetrazol-1-yl)...)
Affinity DataEC50: >2.60E+5nM. Assay description: Keywords: Heat Shock Factor-1 (HSF-1), Stress Response, MG132, NIH3T3, Luminescence Assay Overview: Confirmation testing of small molecules identifie...
Ligand InfoPC cidPC sid
In DepthDetails PCBioAssay