BDBM72687 2-(2,4-dinitrophenyl)sulfanylpyrimidine::2-[(2,4-dinitrophenyl)thio]pyrimidine::MLS000757063::SMR000449836::cid_163121
SMILES [O-][N+](=O)c1ccc(Sc2ncccn2)c(c1)[N+]([O-])=O
InChI Key InChIKey=UDWLPPBHVNQRBL-UHFFFAOYSA-N
Data  2 IC50  1 EC50
  Tab Delimited (TSV)   2D SDfile   Computed 3D by Vconf -m prep SDfile
Find this compound or compounds like it in BindingDB:
Activity Spreadsheet -- Enzyme Inhibition Constant Data from BindingDB
Found 3 hits for monomerid = 72687
TargetHeat shock factor protein 1(Mus musculus)
Broad Institute
Curated by PubChem BioAssay
LigandPNGBDBM72687(2-(2,4-dinitrophenyl)sulfanylpyrimidine | 2-[(2,4-...)
Affinity DataEC50:  6.83E+3nM. Assay description: Keywords: Heat Shock Factor-1 (HSF-1), Stress Response, MG132, NIH3T3, Luminescence Assay Overview: Confirmation testing of small molecules identifie...
In DepthDetails PCBioAssay
Target1-phosphatidylinositol 4,5-bisphosphate phosphodiesterase beta-3(Homo sapiens (Human))
The Scripps Research Institute Molecular Screening Center
Curated by PubChem BioAssay
LigandPNGBDBM72687(2-(2,4-dinitrophenyl)sulfanylpyrimidine | 2-[(2,4-...)
Affinity DataIC50:  1.23E+5nM. Assay description: Source (MLPCN Center Name): The Scripps Research Institute Molecular Screening Center (SRIMSC) Center Affiliation: The Scripps Research Institute Ass...
In DepthDetails PCBioAssay
Target1-phosphatidylinositol 4,5-bisphosphate phosphodiesterase gamma-1 [1-999,I813T](Homo sapiens (Human))
The Scripps Research Institute Molecular Screening Center
Curated by PubChem BioAssay
LigandPNGBDBM72687(2-(2,4-dinitrophenyl)sulfanylpyrimidine | 2-[(2,4-...)
Affinity DataIC50:  1.23E+5nM. Assay description: Source (MLPCN Center Name): The Scripps Research Institute Molecular Screening Center (SRIMSC) Center Affiliation: The Scripps Research Institute Ass...
In DepthDetails PCBioAssay