BDBM7318 14-bromo-4-iodo-8,18-diazatetracyclo[9.7.0.0^{2,7}.0^{12,17}]octadeca-1(11),2,4,6,12(17),13,15-heptaen-9-one::9-Bromo-2-iodo-7,12-dihydro-indolo[3,2-d][1]benzazepin-6(5H)-one::NSC 707622::Paullone Analogue 53
SMILES Brc1ccc2[nH]c-3c(CC(=O)Nc4ccc(I)cc-34)c2c1
InChI Key InChIKey=JKVBIBIZBZBAKL-UHFFFAOYSA-N
Data  3 IC50
  Tab Delimited (TSV)   2D SDfile   Computed 3D by Vconf -m prep SDfile
Find this compound or compounds like it in BindingDB:
Activity Spreadsheet -- Enzyme Inhibition Constant Data from BindingDB
Found 3 hits for monomerid = 7318
TargetCyclin-dependent kinase 1/G2/mitotic-specific cyclin-B(Marthasterias glacialis (starfish))
Universitat Hamburg
LigandPNGBDBM7318(14-bromo-4-iodo-8,18-diazatetracyclo[9.7.0.0^{2,7}...)
Affinity DataIC50:  320nMpH: 7.2 T: 2°C. Assay description: Kinase activities were assayed in buffers containing substrate, enzyme, and inhibitor at 30 °C in the presence of 15 uM ATP/ [gamma-32P] ATP. 32...
In DepthDetails ArticlePubMed
TargetGlycogen synthase kinase-3 beta(Rattus norvegicus (rat))
Universitat Hamburg
LigandPNGBDBM7318(14-bromo-4-iodo-8,18-diazatetracyclo[9.7.0.0^{2,7}...)
Affinity DataIC50:  4.20E+3nMT: 2°C. Assay description: Kinase activities were assayed in buffers containing substrate, enzyme, and inhibitor at 30 °C in the presence of 15 uM ATP/ [gamma-32P] ATP. 32...
In DepthDetails ArticlePubMed
TargetCyclin-dependent kinase 5 activator 1 [99-307](Homo sapiens (Human))
Universitat Hamburg
LigandPNGBDBM7318(14-bromo-4-iodo-8,18-diazatetracyclo[9.7.0.0^{2,7}...)
Affinity DataIC50:  3.00E+4nMT: 2°C. Assay description: Kinase activities were assayed in buffers containing substrate, enzyme, and inhibitor at 30 °C in the presence of 15 uM ATP/ [gamma-32P] ATP. 32...
In DepthDetails ArticlePubMed