BDBM73184 MLS-0267815.0001::N-(4-acetamidophenyl)-2-[6-(furan-2-yl)pyridazin-3-yl]sulfanyl-ethanamide::N-(4-acetamidophenyl)-2-[6-(furan-2-yl)pyridazin-3-yl]sulfanylacetamide::N-(4-acetamidophenyl)-2-[[6-(2-furanyl)-3-pyridazinyl]thio]acetamide::N-(4-acetamidophenyl)-2-[[6-(2-furyl)pyridazin-3-yl]thio]acetamide::cid_7207152
SMILES CC(=O)Nc1ccc(NC(=O)CSc2ccc(nn2)-c2ccco2)cc1
InChI Key InChIKey=KPVNCPNGBSWHME-UHFFFAOYSA-N
Data  3 IC50
  Tab Delimited (TSV)   2D SDfile   Computed 3D by Vconf -m prep SDfile
Find this compound or compounds like it in BindingDB:
Activity Spreadsheet -- Enzyme Inhibition Constant Data from BindingDB
Found 3 hits for monomerid = 73184
TargetEukaryotic translation initiation factor 4H(Homo sapiens (Human))
Burnham Center For Chemical Genomics
Curated by PubChem BioAssay
LigandPNGBDBM73184(MLS-0267815.0001 | N-(4-acetamidophenyl)-2-[6-(fur...)
Affinity DataIC50:  3.11E+4nM. Assay description: Data Source: Sanford-Burnham Center for Chemical Genomics (SBCCG) Source Affiliation: Sanford-Burnham Medical Research Institute (SBIMR, San Diego, C...
In DepthDetails PCBioAssay
TargetNuclear receptor subfamily 5 group A member 2(Homo sapiens (Human))
The Scripps Research Institute Molecular Screening Center
Curated by PubChem BioAssay
LigandPNGBDBM73184(MLS-0267815.0001 | N-(4-acetamidophenyl)-2-[6-(fur...)
Affinity DataIC50: >3.59E+4nM
In DepthDetails PCBioAssay
TargetPolyadenylate-binding protein 1(Homo sapiens (Human))
Burnham Center For Chemical Genomics
Curated by PubChem BioAssay
LigandPNGBDBM73184(MLS-0267815.0001 | N-(4-acetamidophenyl)-2-[6-(fur...)
Affinity DataIC50: >1.00E+5nM. Assay description: Data Source: Sanford-Burnham Center for Chemical Genomics (SBCCG) Source Affiliation: Sanford-Burnham Medical Research Institute(SBMRI, San Diego, CA...
In DepthDetails PCBioAssay