BDBM73333 2-(2-isopropyl-5-methyl-phenoxy)-N-[4-(4-mesylpiperazino)phenyl]acetamide::2-(2-isopropyl-5-methylphenoxy)-N-{4-[4-(methylsulfonyl)-1-piperazinyl]phenyl}acetamide::2-(5-methyl-2-propan-2-yl-phenoxy)-N-[4-(4-methylsulfonylpiperazin-1-yl)phenyl]ethanamide::2-(5-methyl-2-propan-2-ylphenoxy)-N-[4-(4-methylsulfonyl-1-piperazinyl)phenyl]acetamide::2-(5-methyl-2-propan-2-ylphenoxy)-N-[4-(4-methylsulfonylpiperazin-1-yl)phenyl]acetamide::MLS000049463::SMR000075453::cid_1288450
SMILES CC(C)c1ccc(C)cc1OCC(=O)Nc1ccc(cc1)N1CCN(CC1)S(C)(=O)=O
InChI Key InChIKey=XISLVINSHCUZAC-UHFFFAOYSA-N
Data  1 EC50
  Tab Delimited (TSV)   2D SDfile   Computed 3D by Vconf -m prep SDfile
Find this compound or compounds like it in BindingDB:
Activity Spreadsheet -- Enzyme Inhibition Constant Data from BindingDB
Found 1 hit for monomerid = 73333
TargetProtein LANA1(Human herpesvirus 8)
Broad Institute
Curated by PubChem BioAssay
LigandPNGBDBM73333(2-(2-isopropyl-5-methyl-phenoxy)-N-[4-(4-mesylpipe...)
Affinity DataEC50: >7.50E+4nM. Assay description: Primary Collaborators: Kenneth Kaye,Brigham & Womens,Boston MA,kkaye@rics.bwh.harvard.edu,617-525-4256 Chantal Beauchemin,Brigham & Womens,Boston MA,...
In DepthDetails PCBioAssay