BDBM73334 MLS000051290::N-cycloheptyl-3-ethoxy-4-fluoranyl-benzenesulfonamide::N-cycloheptyl-3-ethoxy-4-fluoro-benzenesulfonamide::N-cycloheptyl-3-ethoxy-4-fluorobenzenesulfonamide::SMR000079343::cid_850128
SMILES CCOc1cc(ccc1F)S(=O)(=O)NC1CCCCCC1
InChI Key InChIKey=ZJUOLARXDHEVRS-UHFFFAOYSA-N
Data  1 EC50
  Tab Delimited (TSV)   2D SDfile   Computed 3D by Vconf -m prep SDfile
Find this compound or compounds like it in BindingDB:
Activity Spreadsheet -- Enzyme Inhibition Constant Data from BindingDB
Found 1 hit for monomerid = 73334
TargetProtein LANA1(Human herpesvirus 8)
Broad Institute
Curated by PubChem BioAssay
LigandPNGBDBM73334(MLS000051290 | N-cycloheptyl-3-ethoxy-4-fluoranyl-...)
Affinity DataEC50: >7.50E+4nM. Assay description: Primary Collaborators: Kenneth Kaye,Brigham & Womens,Boston MA,kkaye@rics.bwh.harvard.edu,617-525-4256 Chantal Beauchemin,Brigham & Womens,Boston MA,...
In DepthDetails PCBioAssay