BDBM7356 6-(4-Methylphenyl)[5H]pyrrolo[2,3-b]pyrazine::6-(4-methylphenyl)-5H-pyrrolo[2,3-b]pyrazine::6-phenyl[5H]pyrrolo[2,3-b]pyrazine (aloisine) 24
SMILES Cc1ccc(cc1)-c1cc2nccnc2[nH]1
InChI Key InChIKey=NUXPRKBWNZAEBF-UHFFFAOYSA-N
Data  3 IC50
  Tab Delimited (TSV)   2D SDfile   Computed 3D by Vconf -m prep SDfile
Find this compound or compounds like it in BindingDB:
Activity Spreadsheet -- Enzyme Inhibition Constant Data from BindingDB
Found 3 hits for monomerid = 7356
TargetGlycogen synthase kinase-3 beta(Rattus norvegicus (rat))
Faculte De Medecine Et De Pharmacie
LigandPNGBDBM7356(6-(4-Methylphenyl)[5H]pyrrolo[2,3-b]pyrazine | 6-(...)
Affinity DataIC50:  2.60E+3nMT: 2°C. Assay description: Kinase activities were assayed in buffers containing substrate, enzyme, and inhibitor at 30 °C in the presence of 15 uM ATP/ [gamma-32P] ATP. 32...
In DepthDetails ArticlePubMed
TargetCyclin-dependent kinase 5 activator 1 [99-307](Homo sapiens (Human))
Faculte De Medecine Et De Pharmacie
LigandPNGBDBM7356(6-(4-Methylphenyl)[5H]pyrrolo[2,3-b]pyrazine | 6-(...)
Affinity DataIC50:  1.00E+4nMT: 2°C. Assay description: Kinase activities were assayed in buffers containing substrate, enzyme, and inhibitor at 30 °C in the presence of 15 uM ATP/ [gamma-32P] ATP. 32...
In DepthDetails ArticlePubMed
TargetCyclin-dependent kinase 1/G2/mitotic-specific cyclin-B(Marthasterias glacialis (starfish))
Faculte De Medecine Et De Pharmacie
LigandPNGBDBM7356(6-(4-Methylphenyl)[5H]pyrrolo[2,3-b]pyrazine | 6-(...)
Affinity DataIC50:  3.00E+3nMpH: 7.2 T: 2°C. Assay description: Kinase activities were assayed in buffers containing substrate, enzyme, and inhibitor at 30 °C in the presence of 15 uM ATP/ [gamma-32P] ATP. 32...
In DepthDetails ArticlePubMed