BDBM74463 1-({[5-(1-benzofuran-2-yl)-4-methyl-4H-1,2,4-triazol-3-yl]thio}acetyl)-4-phenylpiperazine::2-[[5-(1-benzofuran-2-yl)-4-methyl-1,2,4-triazol-3-yl]sulfanyl]-1-(4-phenylpiperazin-1-yl)ethanone::2-[[5-(2-benzofuranyl)-4-methyl-1,2,4-triazol-3-yl]thio]-1-(4-phenyl-1-piperazinyl)ethanone::2-[[5-(benzofuran-2-yl)-4-methyl-1,2,4-triazol-3-yl]thio]-1-(4-phenylpiperazino)ethanone::MLS000049711::SMR000077741::cid_1299192
SMILES Cn1c(SCC(=O)N2CCN(CC2)c2ccccc2)nnc1-c1cc2ccccc2o1
InChI Key InChIKey=NNWKQLTXMSTIAV-UHFFFAOYSA-N
Data  3 IC50
  Tab Delimited (TSV)   2D SDfile   Computed 3D by Vconf -m prep SDfile
Find this compound or compounds like it in BindingDB:
Activity Spreadsheet -- Enzyme Inhibition Constant Data from BindingDB
Found 3 hits for monomerid = 74463
TargetTyrosine-protein phosphatase non-receptor type 22(Homo sapiens (Human))
Burnham Center For Chemical Genomics
Curated by PubChem BioAssay
LigandPNGBDBM74463(1-({[5-(1-benzofuran-2-yl)-4-methyl-4H-1,2,4-triaz...)
Affinity DataIC50: >7.94E+4nM. Assay description: Data Source: Sanford-Burnham Center for Chemical Genomics (SBCCG) Source Affiliation: Sanford-Burnham Medical Research Institute (SBMRI, San Diego, ...
In DepthDetails PCBioAssay
TargetTyrosine-protein phosphatase non-receptor type 22(Homo sapiens (Human))
Burnham Center For Chemical Genomics
Curated by PubChem BioAssay
LigandPNGBDBM74463(1-({[5-(1-benzofuran-2-yl)-4-methyl-4H-1,2,4-triaz...)
Affinity DataIC50: >7.94E+4nM. Assay description: Data Source: Sanford-Burnham Center for Chemical Genomics (SBCCG) Source Affiliation: Sanford-Burnham Medical Research Institute (SBMRI, San Diego, ...
In DepthDetails PCBioAssay
TargetTyrosine-protein phosphatase non-receptor type 7(Homo sapiens (Human))
Burnham Center For Chemical Genomics
Curated by PubChem BioAssay
LigandPNGBDBM74463(1-({[5-(1-benzofuran-2-yl)-4-methyl-4H-1,2,4-triaz...)
Affinity DataIC50: >7.94E+4nM. Assay description: Data Source: Sanford-Burnham Center for Chemical Genomics (SBCCG) Source Affiliation: Sanford-Burnham Medical Research Institute (SBMRI, San Diego, C...
In DepthDetails PCBioAssay