BDBM745 (2S,4R)-N-tert-butyl-1-[(2R,3S)-3-[2-(2,6-dimethylphenoxy)acetamido]-2-hydroxy-4-phenylbutyl]-4-[(pyridin-4-ylmethyl)sulfanyl]piperidine-2-carboxamide::Palinavir deriv. 17
SMILES Cc1cccc(C)c1OCC(=O)N[C@@H](Cc1ccccc1)[C@H](O)CN1CC[C@H](C[C@H]1C(=O)NC(C)(C)C)SCc1ccncc1
InChI Key InChIKey=FIWNNAIJMGZTNA-OKDNLZPVSA-N
Data  1 IC50
  Tab Delimited (TSV)   2D SDfile   Computed 3D by Vconf -m prep SDfile
Find this compound or compounds like it in BindingDB:
Activity Spreadsheet -- Enzyme Inhibition Constant Data from BindingDB
Found 1 hit for monomerid = 745
TargetDimer of Gag-Pol polyprotein [489-587](Human immunodeficiency virus type 1)
Boehringer Ingelheim Pharmaceuticals
LigandPNGBDBM745((2S,4R)-N-tert-butyl-1-[(2R,3S)-3-[2-(2,6-dimethyl...)
Affinity DataIC50:  1.80nMpH: 5.5 T: 2°C. Assay description: Sensitivity of HIV-1 protease activity to protease inhibitors was determined by a peptide substrate cleavage assay. Cleavage products and substrate w...
In DepthDetails ArticlePubMed