BDBM74515 (4Z)-2-(4-bromophenyl)-4-(2-furanylmethylidene)-5-oxazolone::(4Z)-2-(4-bromophenyl)-4-(2-furfurylidene)-2-oxazolin-5-one::(4Z)-2-(4-bromophenyl)-4-(furan-2-ylmethylidene)-1,3-oxazol-5-one::MLS000710934::SMR000280700::cid_691746
SMILES Brc1ccc(cc1)C1=N\C(=C/c2ccco2)C(=O)O1
InChI Key InChIKey=CEUKGIXHGCKZOW-WQLSENKSSA-N
Data  3 IC50
  Tab Delimited (TSV)   2D SDfile   Computed 3D by Vconf -m prep SDfile
Find this compound or compounds like it in BindingDB:
Activity Spreadsheet -- Enzyme Inhibition Constant Data from BindingDB
Found 3 hits for monomerid = 74515
TargetTyrosine-protein phosphatase non-receptor type 22(Homo sapiens (Human))
Burnham Center For Chemical Genomics
Curated by PubChem BioAssay
LigandPNGBDBM74515((4Z)-2-(4-bromophenyl)-4-(2-furanylmethylidene)-5-...)
Affinity DataIC50: >7.94E+4nM. Assay description: Data Source: Sanford-Burnham Center for Chemical Genomics (SBCCG) Source Affiliation: Sanford-Burnham Medical Research Institute (SBMRI, San Diego, ...
In DepthDetails PCBioAssay
TargetTyrosine-protein phosphatase non-receptor type 22(Homo sapiens (Human))
Burnham Center For Chemical Genomics
Curated by PubChem BioAssay
LigandPNGBDBM74515((4Z)-2-(4-bromophenyl)-4-(2-furanylmethylidene)-5-...)
Affinity DataIC50: >7.94E+4nM. Assay description: Data Source: Sanford-Burnham Center for Chemical Genomics (SBCCG) Source Affiliation: Sanford-Burnham Medical Research Institute (SBMRI, San Diego, ...
In DepthDetails PCBioAssay
TargetTyrosine-protein phosphatase non-receptor type 7(Homo sapiens (Human))
Burnham Center For Chemical Genomics
Curated by PubChem BioAssay
LigandPNGBDBM74515((4Z)-2-(4-bromophenyl)-4-(2-furanylmethylidene)-5-...)
Affinity DataIC50: >7.94E+4nM. Assay description: Data Source: Sanford-Burnham Center for Chemical Genomics (SBCCG) Source Affiliation: Sanford-Burnham Medical Research Institute (SBMRI, San Diego, C...
In DepthDetails PCBioAssay