BDBM7452 1-aza-9-oxafluorene deriv. 7a::4-methyl-3-phenyl-8-oxa-6-azatricyclo[7.4.0.0^{2,7}]trideca-1(13),2(7),3,5,9,11-hexaen-12-ol::elbfluorene analog
SMILES Cc1cnc2oc3ccc(O)cc3c2c1-c1ccccc1
InChI Key InChIKey=OJTSQWGMSXHCRU-UHFFFAOYSA-N
Data  3 IC50
  Tab Delimited (TSV)   2D SDfile   Computed 3D by Vconf -m prep SDfile
Find this compound or compounds like it in BindingDB:
Activity Spreadsheet -- Enzyme Inhibition Constant Data from BindingDB
Found 3 hits for monomerid = 7452
TargetCyclin-dependent kinase 1/G2/mitotic-specific cyclin-B(Marthasterias glacialis (starfish))
Martin-Luther-University Halle-Wittenberg
LigandPNGBDBM7452(1-aza-9-oxafluorene deriv. 7a | 4-methyl-3-phenyl-...)
Affinity DataIC50: >1.00E+5nMpH: 7.2 T: 2°C. Assay description: Kinase activities were assayed in buffers containing substrate, enzyme, and inhibitor at 30 °C in the presence of 15 uM ATP/ [gamma-32P] ATP. 32...
In DepthDetails ArticlePubMed
TargetCyclin-dependent kinase 4/G1/S-specific cyclin-D1 [L188C](Homo sapiens (Human))
Martin-Luther-University Halle-Wittenberg
LigandPNGBDBM7452(1-aza-9-oxafluorene deriv. 7a | 4-methyl-3-phenyl-...)
Affinity DataIC50: >1.00E+5nMpH: 7.2 T: 2°C. Assay description: Kinase activities were assayed in buffers containing substrate, enzyme, and inhibitor at 30 °C in the presence of 15 uM ATP/ [gamma-32P] ATP. 32...
In DepthDetails ArticlePubMed
TargetCyclin-dependent kinase 2/G1/S-specific cyclin-E1(Homo sapiens (Human))
Martin-Luther-University Halle-Wittenberg
LigandPNGBDBM7452(1-aza-9-oxafluorene deriv. 7a | 4-methyl-3-phenyl-...)
Affinity DataIC50: >1.00E+5nMpH: 7.2 T: 2°C. Assay description: Kinase activities were assayed in buffers containing substrate, enzyme, and inhibitor at 30 °C in the presence of 15 uM ATP/ [gamma-32P] ATP. 32...
In DepthDetails ArticlePubMed