BDBM7488 2-(2-{3-amino-4,5-diphenyl-1H-pyrazolo[3,4-c]pyridazin-1-yl}ethoxy)ethan-1-ol::2-[2-(3-Amino-4,5-diphenyl-1H-pyrazolo[3,4-c]pyridazin-1-yl)ethoxy]ethanol::Pyrazolopyridazine 2j
SMILES Nc1nn(CCOCCO)c2nnc(-c3ccccc3)c(-c3ccccc3)c12
InChI Key InChIKey=BDFQAJUORUKIRF-UHFFFAOYSA-N
Data  1 IC50
  Tab Delimited (TSV)   2D SDfile   Computed 3D by Vconf -m prep SDfile
Find this compound or compounds like it in BindingDB:
Activity Spreadsheet -- Enzyme Inhibition Constant Data from BindingDB
Found 1 hit for monomerid = 7488
TargetCyclin-dependent kinase 1/G2/mitotic-specific cyclin-B(Marthasterias glacialis (starfish))
Universidad San Pablo Ceu
LigandPNGBDBM7488(2-(2-{3-amino-4,5-diphenyl-1H-pyrazolo[3,4-c]pyrid...)
Affinity DataIC50: >5.00E+4nMT: 2°C. Assay description: Kinase activities were assayed in buffers containing substrate, enzyme, and inhibitor at 30 °C in the presence of 15 uM ATP/ [gamma-33P] ATP. 33...
Ligand InfoPC cidPC sid
In DepthDetails ArticlePubMed