BDBM75010 2-(pivaloylamino)-1,3-benzothiazole-6-carboxylic acid methyl ester::2-[(2,2-dimethyl-1-oxopropyl)amino]-1,3-benzothiazole-6-carboxylic acid methyl ester::MLS000419492::SMR000320182::cid_4461872::methyl 2-(2,2-dimethylpropanoylamino)-1,3-benzothiazole-6-carboxylate
SMILES COC(=O)c1ccc2nc(NC(=O)C(C)(C)C)sc2c1
InChI Key InChIKey=MZEDGLINFNOBRO-UHFFFAOYSA-N
Data  1 EC50
  Tab Delimited (TSV)   2D SDfile   Computed 3D by Vconf -m prep SDfile
Find this compound or compounds like it in BindingDB:
Activity Spreadsheet -- Enzyme Inhibition Constant Data from BindingDB
Found 1 hit for monomerid = 75010
TargetImportin subunit alpha-1(Homo sapiens (Human))
Broad Institute
Curated by PubChem BioAssay
LigandPNGBDBM75010(2-(pivaloylamino)-1,3-benzothiazole-6-carboxylic a...)
Affinity DataEC50: >5.00E+5nM. Assay description: Keywords: Counterscreen, FRET assay, HTS, YIC probe, Dose response, Assay Overview: This is a fluorescence resonance energy transfer (FRET)-based b...
In DepthDetails PCBioAssay