BDBM75027 MLS000691875::N-(5,6-dihydrobenzo[h]quinazolin-2-yl)-2-(isopropylsulfanyl)acetamide::N-(5,6-dihydrobenzo[h]quinazolin-2-yl)-2-(isopropylthio)acetamide::N-(5,6-dihydrobenzo[h]quinazolin-2-yl)-2-(propan-2-ylthio)acetamide::N-(5,6-dihydrobenzo[h]quinazolin-2-yl)-2-propan-2-ylsulfanyl-ethanamide::N-(5,6-dihydrobenzo[h]quinazolin-2-yl)-2-propan-2-ylsulfanylacetamide::SMR000333913::cid_1479381
SMILES CC(C)SCC(=O)Nc1ncc2CCc3ccccc3-c2n1
InChI Key InChIKey=FOQBPBYBUJWXRK-UHFFFAOYSA-N
Data  1 EC50
  Tab Delimited (TSV)   2D SDfile   Computed 3D by Vconf -m prep SDfile
Find this compound or compounds like it in BindingDB:
Activity Spreadsheet -- Enzyme Inhibition Constant Data from BindingDB
Found 1 hit for monomerid = 75027
TargetImportin subunit alpha-1(Homo sapiens (Human))
Broad Institute
Curated by PubChem BioAssay
LigandPNGBDBM75027(MLS000691875 | N-(5,6-dihydrobenzo[h]quinazolin-2-...)
Affinity DataEC50:  3.48E+3nM. Assay description: Keywords: Counterscreen, FRET assay, HTS, YIC probe, Dose response, Assay Overview: This is a fluorescence resonance energy transfer (FRET)-based b...
In DepthDetails PCBioAssay