BDBM75085 (E)-2-Cyano-3-(9-methyl-4-oxo-2-phenoxy-4H-pyrido[1,2-a]pyrimidin-3-yl)-acrylamide::(E)-2-cyano-3-(4-keto-9-methyl-2-phenoxy-pyrido[1,2-a]pyrimidin-3-yl)acrylamide::(E)-2-cyano-3-(9-methyl-4-oxidanylidene-2-phenoxy-pyrido[1,2-a]pyrimidin-3-yl)prop-2-enamide::(E)-2-cyano-3-(9-methyl-4-oxo-2-phenoxy-3-pyrido[1,2-a]pyrimidinyl)-2-propenamide::(E)-2-cyano-3-(9-methyl-4-oxo-2-phenoxypyrido[1,2-a]pyrimidin-3-yl)prop-2-enamide::MLS000333249::SMR000436562::cid_946759
SMILES Cc1cccn2c1nc(Oc1ccccc1)c(\C=C(/C#N)C(N)=O)c2=O
InChI Key InChIKey=DGNBKSFUEBKGSH-JLHYYAGUSA-N
Data  1 EC50
  Tab Delimited (TSV)   2D SDfile   Computed 3D by Vconf -m prep SDfile
Find this compound or compounds like it in BindingDB:
Activity Spreadsheet -- Enzyme Inhibition Constant Data from BindingDB
Found 1 hit for monomerid = 75085
TargetImportin subunit alpha-1(Homo sapiens (Human))
Broad Institute
Curated by PubChem BioAssay
LigandPNGBDBM75085((E)-2-Cyano-3-(9-methyl-4-oxo-2-phenoxy-4H-pyrido[...)
Affinity DataEC50:  1.58E+3nM. Assay description: Keywords: Counterscreen, FRET assay, HTS, YIC probe, Dose response, Assay Overview: This is a fluorescence resonance energy transfer (FRET)-based b...
In DepthDetails PCBioAssay