BDBM75221 2-[(2,2-dimethyl-1-oxopropyl)amino]-6-(phenylmethyl)-5,7-dihydro-4H-thieno[2,3-c]pyridine-3-carboxylic acid methyl ester;hydrochloride::6-benzyl-2-(pivaloylamino)-5,7-dihydro-4H-thieno[2,3-c]pyridine-3-carboxylic acid methyl ester;hydrochloride::MLS000879210::SMR000640790::cid_24761886::methyl 2-(2,2-dimethylpropanoylamino)-6-(phenylmethyl)-5,7-dihydro-4H-thieno[2,3-c]pyridine-3-carboxylate;hydrochloride::methyl 6-benzyl-2-(2,2-dimethylpropanoylamino)-5,7-dihydro-4H-thieno[2,3-c]pyridine-3-carboxylate;hydrochloride
SMILES COC(=O)c1c(NC(=O)C(C)(C)C)sc2CN(Cc3ccccc3)CCc12
InChI Key InChIKey=JVZMRYGPOUJAJU-UHFFFAOYSA-N
Data  1 EC50
  Tab Delimited (TSV)   2D SDfile   Computed 3D by Vconf -m prep SDfile
Find this compound or compounds like it in BindingDB:
Activity Spreadsheet -- Enzyme Inhibition Constant Data from BindingDB
Found 1 hit for monomerid = 75221
TargetImportin subunit alpha-1(Homo sapiens (Human))
Broad Institute
Curated by PubChem BioAssay
LigandPNGBDBM75221(2-[(2,2-dimethyl-1-oxopropyl)amino]-6-(phenylmethy...)
Affinity DataEC50:  2.17E+5nM. Assay description: Keywords: Counterscreen, FRET assay, HTS, YIC probe, Dose response, Assay Overview: This is a fluorescence resonance energy transfer (FRET)-based b...
In DepthDetails PCBioAssay