BDBM75335 2-chloranyl-3-[2-(3,4-dichlorophenyl)-1,2,3,4-tetrazol-5-yl]pyridine::2-chloro-3-[2-(3,4-dichlorophenyl)-5-tetrazolyl]pyridine::2-chloro-3-[2-(3,4-dichlorophenyl)tetrazol-5-yl]pyridine::MLS-0067101.0001::cid_16066630
SMILES Clc1ccc(cc1Cl)-n1nnc(n1)-c1cccnc1Cl
InChI Key InChIKey=NEIJVSMAWWDACY-UHFFFAOYSA-N
Data  1 IC50
  Tab Delimited (TSV)   2D SDfile   Computed 3D by Vconf -m prep SDfile
Find this compound or compounds like it in BindingDB:
Activity Spreadsheet -- Enzyme Inhibition Constant Data from BindingDB
Found 1 hit for monomerid = 75335
TargetDual specificity protein phosphatase 3(Homo sapiens (Human))
Burnham Center For Chemical Genomics
Curated by PubChem BioAssay
LigandPNGBDBM75335(2-chloranyl-3-[2-(3,4-dichlorophenyl)-1,2,3,4-tetr...)
Affinity DataIC50:  5.31E+4nM. Assay description: Data Source: Burnham Center for Chemical Genomics (BCCG) Source Affiliation: Sanford-Burnham Medical Research Institute (SBMRI, San Diego, CA) Networ...
In DepthDetails PCBioAssay