BDBM75349 (3E)-6-methoxy-3-[2-(4-methylphenyl)-1H-1,2,3,4-tetrazol-5-ylidene]quinolin-2-one::(3E)-6-methoxy-3-[2-(4-methylphenyl)-1H-tetrazol-5-ylidene]-2-quinolinone::(3E)-6-methoxy-3-[2-(4-methylphenyl)-1H-tetrazol-5-ylidene]quinolin-2-one::(3E)-6-methoxy-3-[2-(p-tolyl)-1H-tetrazol-5-ylidene]carbostyril::MLS-0067117.0001::cid_16654620
SMILES COc1ccc2nc(O)c(cc2c1)-c1nnn(n1)-c1ccc(C)cc1
InChI Key InChIKey=NOTPEWVYAIRBTA-UHFFFAOYSA-N
Data  1 IC50
  Tab Delimited (TSV)   2D SDfile   Computed 3D by Vconf -m prep SDfile
Find this compound or compounds like it in BindingDB:
Activity Spreadsheet -- Enzyme Inhibition Constant Data from BindingDB
Found 1 hit for monomerid = 75349
TargetDual specificity protein phosphatase 3(Homo sapiens (Human))
Burnham Center For Chemical Genomics
Curated by PubChem BioAssay
LigandPNGBDBM75349((3E)-6-methoxy-3-[2-(4-methylphenyl)-1H-1,2,3,4-te...)
Affinity DataIC50:  1.19E+4nM. Assay description: Data Source: Burnham Center for Chemical Genomics (BCCG) Source Affiliation: Sanford-Burnham Medical Research Institute (SBMRI, San Diego, CA) Networ...
In DepthDetails PCBioAssay