BDBM75409 KSC-10-206::KUC105571N::N-butyl-N-[(6-chloranyl-2-oxidanylidene-1H-quinolin-3-yl)methyl]thiophene-2-carboxamide::N-butyl-N-[(6-chloro-2-keto-1H-quinolin-3-yl)methyl]thiophene-2-carboxamide::N-butyl-N-[(6-chloro-2-oxo-1H-quinolin-3-yl)methyl]-2-thiophenecarboxamide::N-butyl-N-[(6-chloro-2-oxo-1H-quinolin-3-yl)methyl]thiophene-2-carboxamide::cid_45479172
SMILES CCCCN(Cc1cc2cc(Cl)ccc2[nH]c1=O)C(=O)c1cccs1
InChI Key InChIKey=TWCQLHJLFLNQNK-UHFFFAOYSA-N
Data  1 EC50
  Tab Delimited (TSV)   2D SDfile   Computed 3D by Vconf -m prep SDfile
Find this compound or compounds like it in BindingDB:
Activity Spreadsheet -- Enzyme Inhibition Constant Data from BindingDB
Found 1 hit for monomerid = 75409
TargetKappa-type opioid receptor(Homo sapiens (Human))
Burnham Center For Chemical Genomics
Curated by PubChem BioAssay
LigandPNGBDBM75409(KSC-10-206 | KUC105571N | N-butyl-N-[(6-chloranyl-...)
Affinity DataEC50: >2.00E+4nM. Assay description: Data Source: Sanford-Burnham Center for Chemical Genomics (SBCCG) Source Affiliation: Sanford-Burnham Medical Research Institute (SBMRI, San Diego, C...
Ligand InfoPC cidPC sid
In DepthDetails PCBioAssay