BDBM75549 (4-Methoxy-benzyl)-(5H-pyrimido[5,4-b]indol-4-yl)-amine::MLS000768346::N-[(4-methoxyphenyl)methyl]-5H-pyrimido[5,4-b]indol-4-amine::SMR000431667::cid_921775::p-anisyl(5H-pyrimid[5,4-b]indol-4-yl)amine
SMILES COc1ccc(CNc2ncnc3c4ccccc4[nH]c23)cc1
InChI Key InChIKey=QRKWRYCXEZAQJQ-UHFFFAOYSA-N
Data  2 IC50  2 EC50
  Tab Delimited (TSV)   2D SDfile   Computed 3D by Vconf -m prep SDfile
Find this compound or compounds like it in BindingDB:
Activity Spreadsheet -- Enzyme Inhibition Constant Data from BindingDB
Found 4 hits for monomerid = 75549
TargetOxytocin receptor(Homo sapiens (Human))
The Scripps Research Institute Molecular Screening Center
Curated by PubChem BioAssay
LigandPNGBDBM75549((4-Methoxy-benzyl)-(5H-pyrimido[5,4-b]indol-4-yl)-...)
Affinity DataEC50:  2.74E+4nM. Assay description: Source (MLPCN Center Name): The Scripps Research Institute Molecular Screening Center (SRIMSC) Center Affiliation: The Scripps Research Institute (TS...
In DepthDetails PCBioAssay
TargetProtein Wnt-3a(Mus musculus)
Burnham Center For Chemical Genomics
Curated by PubChem BioAssay
LigandPNGBDBM75549((4-Methoxy-benzyl)-(5H-pyrimido[5,4-b]indol-4-yl)-...)
Affinity DataIC50:  1.24E+4nM
In DepthDetails PCBioAssay
TargetZinc finger protein GLI1(Mus musculus)
Burnham Center For Chemical Genomics
Curated by PubChem BioAssay
LigandPNGBDBM75549((4-Methoxy-benzyl)-(5H-pyrimido[5,4-b]indol-4-yl)-...)
Affinity DataIC50:  2.79E+3nM. Assay description: Data Source: Sanford-Burnham Center for Chemical Genomics (SBCCG) Source Affiliation: Sanford-Burnham Medical Research Institute (SBMRI, San Diego, C...
In DepthDetails PCBioAssay
TargetVasopressin V1a receptor(Homo sapiens (Human))
The Scripps Research Institute Molecular Screening Center
Curated by PubChem BioAssay
LigandPNGBDBM75549((4-Methoxy-benzyl)-(5H-pyrimido[5,4-b]indol-4-yl)-...)
Affinity DataEC50: >2.99E+4nM. Assay description: Source (MLPCN Center Name): The Scripps Research Institute Molecular Screening Center (SRIMSC) Center Affiliation: The Scripps Research Institute (TS...
In DepthDetails PCBioAssay