BDBM75550 MLS001079319::N-[2-(2-furanyl)-2-(1-piperidinyl)ethyl]-4-[(4-methylphenyl)sulfamoyl]benzamide::N-[2-(2-furyl)-2-piperidino-ethyl]-4-(p-tolylsulfamoyl)benzamide::N-[2-(furan-2-yl)-2-piperidin-1-yl-ethyl]-4-[(4-methylphenyl)sulfamoyl]benzamide::N-[2-(furan-2-yl)-2-piperidin-1-ylethyl]-4-[(4-methylphenyl)sulfamoyl]benzamide::SMR000709510::cid_24979260
SMILES Cc1ccc(NS(=O)(=O)c2ccc(cc2)C(=O)NCC(N2CCCCC2)c2ccco2)cc1
InChI Key InChIKey=CHGMWIQKNZGDME-UHFFFAOYSA-N
Data  2 EC50
  Tab Delimited (TSV)   2D SDfile   Computed 3D by Vconf -m prep SDfile
Find this compound or compounds like it in BindingDB:
Activity Spreadsheet -- Enzyme Inhibition Constant Data from BindingDB
Found 2 hits for monomerid = 75550
TargetVasopressin V1a receptor(Homo sapiens (Human))
The Scripps Research Institute Molecular Screening Center
Curated by PubChem BioAssay
LigandPNGBDBM75550(MLS001079319 | N-[2-(2-furanyl)-2-(1-piperidinyl)e...)
Affinity DataEC50: >2.99E+4nM. Assay description: Source (MLPCN Center Name): The Scripps Research Institute Molecular Screening Center (SRIMSC) Center Affiliation: The Scripps Research Institute (TS...
In DepthDetails PCBioAssay
TargetOxytocin receptor(Homo sapiens (Human))
The Scripps Research Institute Molecular Screening Center
Curated by PubChem BioAssay
LigandPNGBDBM75550(MLS001079319 | N-[2-(2-furanyl)-2-(1-piperidinyl)e...)
Affinity DataEC50: >2.99E+4nM. Assay description: Source (MLPCN Center Name): The Scripps Research Institute Molecular Screening Center (SRIMSC) Center Affiliation: The Scripps Research Institute (TS...
In DepthDetails PCBioAssay