BDBM75679 4-chloranyl-3-[[(2-hydroxyphenyl)carbonylamino]carbamoyl]-N-(2-methoxyphenyl)-N-methyl-benzenesulfonamide::4-chloro-3-[[(2-hydroxybenzoyl)amino]carbamoyl]-N-(2-methoxyphenyl)-N-methylbenzenesulfonamide::4-chloro-3-[[[(2-hydroxyphenyl)-oxomethyl]hydrazo]-oxomethyl]-N-(2-methoxyphenyl)-N-methylbenzenesulfonamide::4-chloro-N-(2-methoxyphenyl)-N-methyl-3-[(salicyloylamino)carbamoyl]benzenesulfonamide::MLS001139919::SMR000709693::cid_24818116
SMILES COc1ccccc1N(C)S(=O)(=O)c1ccc(Cl)c(c1)C(=O)NNC(=O)c1ccccc1O
InChI Key InChIKey=VODKVGBCDRUUQZ-UHFFFAOYSA-N
Data  5 EC50
  Tab Delimited (TSV)   2D SDfile   Computed 3D by Vconf -m prep SDfile
Find this compound or compounds like it in BindingDB:
Activity Spreadsheet -- Enzyme Inhibition Constant Data from BindingDB
Found 5 hits for monomerid = 75679
TargetIntestinal-type alkaline phosphatase(Homo sapiens (Human))
Burnham Center For Chemical Genomics
Curated by PubChem BioAssay
LigandPNGBDBM75679(4-chloranyl-3-[[(2-hydroxyphenyl)carbonylamino]car...)
Affinity DataEC50:  1.15E+4nM. Assay description: Data Source: Sanford-Burnham Center for Chemical Genomics (SBCCG) Source Affiliation: Sanford-Burnham Medical Research Institute (SBMRI, San Diego, C...
In DepthDetails PCBioAssay
TargetIntestinal-type alkaline phosphatase(Homo sapiens (Human))
Burnham Center For Chemical Genomics
Curated by PubChem BioAssay
LigandPNGBDBM75679(4-chloranyl-3-[[(2-hydroxyphenyl)carbonylamino]car...)
Affinity DataEC50:  1.57E+4nM. Assay description: Data Source: Sanford-Burnham Center for Chemical Genomics (SBCCG) Source Affiliation: Sanford-Burnham Medical Research Institute (SBMRI, San Diego, C...
In DepthDetails PCBioAssay
TargetAlkaline phosphatase, germ cell type(Homo sapiens (Human))
Burnham Center For Chemical Genomics
Curated by PubChem BioAssay
LigandPNGBDBM75679(4-chloranyl-3-[[(2-hydroxyphenyl)carbonylamino]car...)
Affinity DataEC50:  1.95E+4nM. Assay description: Data Source: Sanford-Burnham Center for Chemical Genomics (SBCCG) Source Affiliation: Sanford-Burnham Medical Research Institute (SBMRI, San Diego, C...
In DepthDetails PCBioAssay
TargetAlkaline phosphatase, tissue-nonspecific isozyme(Homo sapiens (Human))
Burnham Center For Chemical Genomics
Curated by PubChem BioAssay
LigandPNGBDBM75679(4-chloranyl-3-[[(2-hydroxyphenyl)carbonylamino]car...)
Affinity DataEC50:  2.65E+4nM. Assay description: Data Source: Sanford-Burnham Center for Chemical Genomics (SBCCG) Source Affiliation: Sanford-Burnham Medical Research Institute (SBMRI, San Diego, C...
In DepthDetails PCBioAssay
TargetIntestinal-type alkaline phosphatase 1(Rattus norvegicus (Rat))
Burnham Center For Chemical Genomics
Curated by PubChem BioAssay
LigandPNGBDBM75679(4-chloranyl-3-[[(2-hydroxyphenyl)carbonylamino]car...)
Affinity DataEC50: >1.00E+5nM. Assay description: Data Source: Sanford-Burnham Center for Chemical Genomics (SBCCG) Source Affiliation: Sanford-Burnham Medical Research Institute (SBMRI, San Diego, C...
In DepthDetails PCBioAssay