BDBM75728 4-amino-2-(phenacylthio)-5-pyrimidinecarboxylic acid ethyl ester::4-amino-2-(phenacylthio)pyrimidine-5-carboxylic acid ethyl ester::MLS000105804::SMR000102781::cid_747731::ethyl 4-amino-2-phenacylsulfanylpyrimidine-5-carboxylate::ethyl 4-azanyl-2-phenacylsulfanyl-pyrimidine-5-carboxylate
SMILES CCOC(=O)c1cnc(SCC(=O)c2ccccc2)nc1N
InChI Key InChIKey=KVJQVOWSLKHYOA-UHFFFAOYSA-N
Data  1 IC50
  Tab Delimited (TSV)   2D SDfile   Computed 3D by Vconf -m prep SDfile
Find this compound or compounds like it in BindingDB:
Activity Spreadsheet -- Enzyme Inhibition Constant Data from BindingDB
Found 1 hit for monomerid = 75728
TargetIntestinal-type alkaline phosphatase(Homo sapiens (Human))
Burnham Center For Chemical Genomics
Curated by PubChem BioAssay
LigandPNGBDBM75728(4-amino-2-(phenacylthio)-5-pyrimidinecarboxylic ac...)
Affinity DataIC50: >1.00E+5nM. Assay description: Data Source: Sanford-Burnham Center for Chemical Genomics (SBCCG) Source Affiliation: Sanford-Burnham Medical Research Institute (SBMRI, San Diego, C...
In DepthDetails PCBioAssay