BDBM75777 2-[[(4-ketoquinazolin-3-yl)amino]methylene]-5,5-dimethyl-cyclohexane-1,3-quinone::5,5-Dimethyl-2-[(4-oxo-4H-quinazolin-3-ylamino)-methylene]-cyclohexane-1,3-dione::5,5-dimethyl-2-[[(4-oxidanylidenequinazolin-3-yl)amino]methylidene]cyclohexane-1,3-dione::5,5-dimethyl-2-[[(4-oxo-3-quinazolinyl)amino]methylidene]cyclohexane-1,3-dione::5,5-dimethyl-2-[[(4-oxoquinazolin-3-yl)amino]methylidene]cyclohexane-1,3-dione::MLS000031760::SMR000001099::cid_648673
SMILES [#6]C1([#6])[#6]-[#6](=O)\[#6](=[#6]\[#7]-n2cnc3ccccc3c2=O)-[#6](=O)-[#6]1
InChI Key InChIKey=HTLYYRFLLFFQPW-UHFFFAOYSA-N
Data  1 IC50
  Tab Delimited (TSV)   2D SDfile   Computed 3D by Vconf -m prep SDfile
Find this compound or compounds like it in BindingDB:
Activity Spreadsheet -- Enzyme Inhibition Constant Data from BindingDB
Found 1 hit for monomerid = 75777
TargetFurin(Homo sapiens (Human))
University Of Pittsburgh
Curated by PubChem BioAssay
LigandPNGBDBM75777(2-[[(4-ketoquinazolin-3-yl)amino]methylene]-5,5-di...)
Affinity DataIC50: >5.00E+4nM. Assay description: Official Symbol FURIN and Name: furin (paired basic amino acid cleaving enzyme) [Homo sapiens] Other Aliases: FUR, PACE, PCSK3, SPC1 Other Designati...
In DepthDetails PCBioAssay