BDBM75796 (3Z)-3-[(4-fluoroanilino)methylene]isobenzothiophen-1-one::(3Z)-3-[(4-fluoroanilino)methylidene]-2-benzothiophen-1-one::(3Z)-3-[[(4-fluorophenyl)amino]methylidene]-2-benzothiophen-1-one::3-[(4-fluoroanilino)methylene]-2-benzothiophen-1(3H)-one::MLS000328010::SMR000168561::cid_5525092
SMILES Fc1ccc(NC=C2SC(=O)c3ccccc23)cc1
InChI Key InChIKey=IYHYRRCIFOJKIO-UHFFFAOYSA-N
Data  1 IC50
  Tab Delimited (TSV)   2D SDfile   Computed 3D by Vconf -m prep SDfile
Find this compound or compounds like it in BindingDB:
Activity Spreadsheet -- Enzyme Inhibition Constant Data from BindingDB
Found 1 hit for monomerid = 75796
TargetInsulin-degrading enzyme(Homo sapiens (Human))
The Scripps Research Institute Molecular Screening Center
Curated by PubChem BioAssay
LigandPNGBDBM75796((3Z)-3-[(4-fluoroanilino)methylene]isobenzothiophe...)
Affinity DataIC50: >5.59E+4nM. Assay description: Source (MLPCN Center Name): The Scripps Research Institute Molecular Screening Center (SRIMSC) Center Affiliation: The Scripps Research Institute (TS...
In DepthDetails PCBioAssay