BDBM75829 2-(3-chlorophenyl)-3-methyl-4-quinolinecarboxylic acid [2-[(1,1-dioxo-3-thiolanyl)-methylamino]-2-oxoethyl] ester::2-(3-chlorophenyl)-3-methyl-cinchoninic acid [2-[(1,1-diketothiolan-3-yl)-methyl-amino]-2-keto-ethyl] ester::MLS000771741::SMR000376403::[2-[(1,1-dioxothiolan-3-yl)-methylamino]-2-oxoethyl] 2-(3-chlorophenyl)-3-methylquinoline-4-carboxylate::[2-[[1,1-bis(oxidanylidene)thiolan-3-yl]-methyl-amino]-2-oxidanylidene-ethyl] 2-(3-chlorophenyl)-3-methyl-quinoline-4-carboxylate::cid_3996045
SMILES CN(C1CCS(=O)(=O)C1)C(=O)COC(=O)c1c(C)c(nc2ccccc12)-c1cccc(Cl)c1
InChI Key InChIKey=WNJYVPDUXMZDLA-UHFFFAOYSA-N
Data  1 IC50
  Tab Delimited (TSV)   2D SDfile   Computed 3D by Vconf -m prep SDfile
Find this compound or compounds like it in BindingDB:
Activity Spreadsheet -- Enzyme Inhibition Constant Data from BindingDB
Found 1 hit for monomerid = 75829
TargetInsulin-degrading enzyme(Homo sapiens (Human))
The Scripps Research Institute Molecular Screening Center
Curated by PubChem BioAssay
LigandPNGBDBM75829(2-(3-chlorophenyl)-3-methyl-4-quinolinecarboxylic ...)
Affinity DataIC50: >5.59E+4nM. Assay description: Source (MLPCN Center Name): The Scripps Research Institute Molecular Screening Center (SRIMSC) Center Affiliation: The Scripps Research Institute (TS...
In DepthDetails PCBioAssay