BDBM76001 MLS000889556::N-(4-{2-[5-(3-Methoxy-phenyl)-thiazolo[2,3-c][1,2,4]triazol-3-ylsulfanyl]-acetyl}-phenyl)-acetamide::N-[4-[2-[[5-(3-methoxyphenyl)-3-thiazolo[2,3-c][1,2,4]triazolyl]thio]-1-oxoethyl]phenyl]acetamide::N-[4-[2-[[5-(3-methoxyphenyl)-[1,3]thiazolo[2,3-c][1,2,4]triazol-3-yl]sulfanyl]acetyl]phenyl]acetamide::N-[4-[2-[[5-(3-methoxyphenyl)-[1,3]thiazolo[2,3-c][1,2,4]triazol-3-yl]sulfanyl]ethanoyl]phenyl]ethanamide::N-[4-[2-[[5-(3-methoxyphenyl)thiazolo[2,3-c][1,2,4]triazol-3-yl]thio]acetyl]phenyl]acetamide::SMR000007138::cid_651911
SMILES COc1cccc(c1)-c1csc2nnc(SCC(=O)c3ccc(NC(C)=O)cc3)n12
InChI Key InChIKey=BVCIFDQVYLSSQK-UHFFFAOYSA-N
Data  2 IC50
  Tab Delimited (TSV)   2D SDfile   Computed 3D by Vconf -m prep SDfile
Find this compound or compounds like it in BindingDB:
Activity Spreadsheet -- Enzyme Inhibition Constant Data from BindingDB
Found 2 hits for monomerid = 76001
TargetPhotoreceptor-specific nuclear receptor(Homo sapiens (Human))
The Scripps Research Institute Molecular Screening Center
Curated by PubChem BioAssay
LigandPNGBDBM76001(MLS000889556 | N-(4-{2-[5-(3-Methoxy-phenyl)-thiaz...)
Affinity DataIC50:  4.90E+3nM. Assay description: Source (MLPCN Center Name): The Scripps Research Institute Molecular Screening Center Affiliation: The Scripps Research Institute, TSRI Assay Provide...
In DepthDetails PCBioAssay
TargetIsoform 2 of Nuclear receptor corepressor 2 (TRAC-1)(Homo sapiens (Human))
The Scripps Research Institute Molecular Screening Center
Curated by PubChem BioAssay
LigandPNGBDBM76001(MLS000889556 | N-(4-{2-[5-(3-Methoxy-phenyl)-thiaz...)
Affinity DataIC50:  6.73E+3nM. Assay description: Source (MLPCN Center Name): The Scripps Research Institute Molecular Screening Center Affiliation: The Scripps Research Institute, TSRI Assay Provide...
In DepthDetails PCBioAssay