BDBM76023 MLS001142070::N-[2-(4-acetamidoanilino)-2-keto-ethyl]-3-chloro-benzothiophene-2-carboxamide::N-[2-(4-acetamidoanilino)-2-oxoethyl]-3-chloro-1-benzothiophene-2-carboxamide::N-[2-[(4-acetamidophenyl)amino]-2-oxidanylidene-ethyl]-3-chloranyl-1-benzothiophene-2-carboxamide::SMR000715246::cid_24980121
SMILES CC(=O)Nc1ccc(NC(=O)CNC(=O)c2sc3ccccc3c2Cl)cc1
InChI Key InChIKey=RDDVZVKEEXUIJU-UHFFFAOYSA-N
Data  2 IC50
  Tab Delimited (TSV)   2D SDfile   Computed 3D by Vconf -m prep SDfile
Find this compound or compounds like it in BindingDB:
Activity Spreadsheet -- Enzyme Inhibition Constant Data from BindingDB
Found 2 hits for monomerid = 76023
TargetPhotoreceptor-specific nuclear receptor(Homo sapiens (Human))
The Scripps Research Institute Molecular Screening Center
Curated by PubChem BioAssay
LigandPNGBDBM76023(MLS001142070 | N-[2-(4-acetamidoanilino)-2-keto-et...)
Affinity DataIC50:  1.55E+4nM. Assay description: Source (MLPCN Center Name): The Scripps Research Institute Molecular Screening Center Affiliation: The Scripps Research Institute, TSRI Assay Provide...
In DepthDetails PCBioAssay
TargetIsoform 2 of Nuclear receptor corepressor 2 (TRAC-1)(Homo sapiens (Human))
The Scripps Research Institute Molecular Screening Center
Curated by PubChem BioAssay
LigandPNGBDBM76023(MLS001142070 | N-[2-(4-acetamidoanilino)-2-keto-et...)
Affinity DataIC50:  1.11E+4nM. Assay description: Source (MLPCN Center Name): The Scripps Research Institute Molecular Screening Center Affiliation: The Scripps Research Institute, TSRI Assay Provide...
In DepthDetails PCBioAssay