BDBM76265 1-ethyl-2-[(4-methoxyphenoxy)methyl]-5-benzimidazolecarboxylic acid ethyl ester::1-ethyl-2-[(4-methoxyphenoxy)methyl]benzimidazole-5-carboxylic acid ethyl ester::MLS000564864::SMR000152141::cid_3397231::ethyl 1-ethyl-2-[(4-methoxyphenoxy)methyl]benzimidazole-5-carboxylate
SMILES CCOC(=O)c1ccc2n(CC)c(COc3ccc(OC)cc3)nc2c1
InChI Key InChIKey=OBYLCHJXSDPSBD-UHFFFAOYSA-N
Data  2 IC50
  Tab Delimited (TSV)   2D SDfile   Computed 3D by Vconf -m prep SDfile
Find this compound or compounds like it in BindingDB:
Activity Spreadsheet -- Enzyme Inhibition Constant Data from BindingDB
Found 2 hits for monomerid = 76265
TargetNACHT, LRR and PYD domains-containing protein 3(Homo sapiens (Human))
Burnham Center For Chemical Genomics
Curated by PubChem BioAssay
LigandPNGBDBM76265(1-ethyl-2-[(4-methoxyphenoxy)methyl]-5-benzimidazo...)
Affinity DataIC50:  9.83E+3nM. Assay description: Data Source: Sanford-Burnham Center for Chemical Genomics (SBCCG) Source Affiliation: Sanford-Burnham Medical Research Institute (SBMRI, San Diego, C...
In DepthDetails PCBioAssay
TargetNACHT, LRR and PYD domains-containing protein 3(Homo sapiens (Human))
Burnham Center For Chemical Genomics
Curated by PubChem BioAssay
LigandPNGBDBM76265(1-ethyl-2-[(4-methoxyphenoxy)methyl]-5-benzimidazo...)
Affinity DataIC50: >1.00E+5nM. Assay description: Data Source: Sanford-Burnham Center for Chemical Genomics (SBCCG) Source Affiliation: Sanford-Burnham Medical Research Institute (SBMRI, San Diego, C...
In DepthDetails PCBioAssay