BDBM76307 6-(2,4-dibromoanilino)-2-methyl-5-nitro-1H-pyrimidin-4-one::6-(2,4-dibromophenylamino)-2-methyl-5-nitropyrimidin-4-ol::6-[[2,4-bis(bromanyl)phenyl]amino]-2-methyl-5-nitro-1H-pyrimidin-4-one::MLS001060838::SMR000486294::cid_11795481
SMILES Cc1[nH+]c(Nc2ccc(Br)cc2Br)c([N+]([O-])=O)c(=O)[n-]1
InChI Key InChIKey=YMUORZKXTRCHID-UHFFFAOYSA-N
Data  1 EC50
  Tab Delimited (TSV)   2D SDfile   Computed 3D by Vconf -m prep SDfile
Find this compound or compounds like it in BindingDB:
Activity Spreadsheet -- Enzyme Inhibition Constant Data from BindingDB
Found 1 hit for monomerid = 76307
TargetCitrate synthase, peroxisomal [1-24](Saccharomyces cerevisiae)
Nmmlsc
Curated by PubChem BioAssay
LigandPNGBDBM76307(6-(2,4-dibromoanilino)-2-methyl-5-nitro-1H-pyrimid...)
Affinity DataEC50:  7.41E+4nM. Assay description: University of New Mexico Assay Overview: Assay Support: 1R03 MH086450-01 Project Title: Chemical Screen of TOR pathway GFP fusion proteins in S. ...
Ligand InfoPC cidPC sid
In DepthDetails PCBioAssay