BDBM7647 4-[(4-{2-methylimidazo[1,2-a]pyridin-3-yl}pyrimidin-2-yl)amino]benzene-1-sulfonamide::Imidazo[1,2-a]pyridine deriv. 7
SMILES Cc1nc2ccccn2c1-c1ccnc(Nc2ccc(cc2)S(N)(=O)=O)n1
InChI Key InChIKey=DLYVGVOGPLQZFG-UHFFFAOYSA-N
Data  2 IC50
  Tab Delimited (TSV)   2D SDfile   Computed 3D by Vconf -m prep SDfile
Find this compound or compounds like it in BindingDB:
Activity Spreadsheet -- Enzyme Inhibition Constant Data from BindingDB
Found 2 hits for monomerid = 7647
TargetCyclin-dependent kinase 4/G1/S-specific cyclin-D1(Homo sapiens (Human))
Astrazeneca
LigandPNGBDBM7647(4-[(4-{2-methylimidazo[1,2-a]pyridin-3-yl}pyrimidi...)
Affinity DataIC50:  2.50E+3nMpH: 7.0 T: 2°C. Assay description: The kinase activity was assayed using an in vitro scintillation proximity assay (SPA) for measuring incorporation of [gamma-33P] ATP into GST-Rb.
In DepthDetails ArticlePubMed
TargetCyclin-dependent kinase 2/G1/S-specific cyclin-E1(Homo sapiens (Human))
Astrazeneca
LigandPNGBDBM7647(4-[(4-{2-methylimidazo[1,2-a]pyridin-3-yl}pyrimidi...)
Affinity DataIC50: <3nMpH: 7.0 T: 2°C. Assay description: The kinase activity was assayed using an in vitro scintillation proximity assay (SPA) for measuring incorporation of [gamma-33P] ATP into GST-Rb.
In DepthDetails ArticlePubMed