BDBM76548 4-(2-quinoxalinylamino)benzoic acid ethyl ester::4-(quinoxalin-2-ylamino)benzoic acid ethyl ester::MLS000720674::SMR000336417::cid_1482857::ethyl 4-(2-quinoxalinylamino)benzenecarboxylate::ethyl 4-(quinoxalin-2-ylamino)benzoate
SMILES CCOC(=O)c1ccc(Nc2cnc3ccccc3n2)cc1
InChI Key InChIKey=ZCLXAFUZIXNJHF-UHFFFAOYSA-N
Data  3 IC50
  Tab Delimited (TSV)   2D SDfile   Computed 3D by Vconf -m prep SDfile
Find this compound or compounds like it in BindingDB:
Activity Spreadsheet -- Enzyme Inhibition Constant Data from BindingDB
Found 3 hits for monomerid = 76548
TargetCaspase-3(Homo sapiens (Human))
Burnham Center For Chemical Genomics
Curated by PubChem BioAssay
LigandPNGBDBM76548(4-(2-quinoxalinylamino)benzoic acid ethyl ester | ...)
Affinity DataIC50:  6.46E+4nM. Assay description: Data Source: Sanford-Burnham Center for Chemical Genomics (SBCCG) Source Affiliation: Sanford-Burnham Medical Research Institute (SBMRI, San Diego, C...
In DepthDetails PCBioAssay
TargetSentrin-specific protease 6(Homo sapiens (Human))
Burnham Center For Chemical Genomics
Curated by PubChem BioAssay
LigandPNGBDBM76548(4-(2-quinoxalinylamino)benzoic acid ethyl ester | ...)
Affinity DataIC50: >1.00E+5nM. Assay description: Data Source: Sanford-Burnham Center for Chemical Genomics (SBCCG) Source Affiliation: Sanford-Burnham Medical Research Institute (SBMRI, San Diego, C...
In DepthDetails PCBioAssay
TargetSentrin-specific protease 8(Homo sapiens (Human))
Burnham Center For Chemical Genomics
Curated by PubChem BioAssay
LigandPNGBDBM76548(4-(2-quinoxalinylamino)benzoic acid ethyl ester | ...)
Affinity DataIC50: >1.00E+5nM. Assay description: Data Source: Sanford-Burnham Center for Chemical Genomics (SBCCG) Source Affiliation: Sanford-Burnham Medical Research Institute (SBMRI, San Diego, C...
In DepthDetails PCBioAssay