BDBM76794 5-nitro-2-thiophenecarboxylic acid [2-oxo-2-(1H-pyrrol-2-yl)ethyl] ester::5-nitrothiophene-2-carboxylic acid [2-keto-2-(1H-pyrrol-2-yl)ethyl] ester::MLS002251424::SMR000835695::[2-oxidanylidene-2-(1H-pyrrol-2-yl)ethyl] 5-nitrothiophene-2-carboxylate::[2-oxo-2-(1H-pyrrol-2-yl)ethyl] 5-nitrothiophene-2-carboxylate::cid_4848682
SMILES [O-][N+](=O)c1ccc(s1)C(=O)OCC(=O)c1ccc[nH]1
InChI Key InChIKey=GDNAYAZKMJKMPI-UHFFFAOYSA-N
Data  4 IC50  1 EC50
  Tab Delimited (TSV)   2D SDfile   Computed 3D by Vconf -m prep SDfile
Find this compound or compounds like it in BindingDB:
Activity Spreadsheet -- Enzyme Inhibition Constant Data from BindingDB
Found 5 hits for monomerid = 76794
TargetSentrin-specific protease 6(Homo sapiens (Human))
Burnham Center For Chemical Genomics
Curated by PubChem BioAssay
LigandPNGBDBM76794(5-nitro-2-thiophenecarboxylic acid [2-oxo-2-(1H-py...)
Affinity DataIC50:  6.52E+3nM. Assay description: Data Source: Sanford-Burnham Center for Chemical Genomics (SBCCG) Source Affiliation: Sanford-Burnham Medical Research Institute (SBMRI, San Diego, C...
In DepthDetails PCBioAssay
TargetCaspase-3(Homo sapiens (Human))
Burnham Center For Chemical Genomics
Curated by PubChem BioAssay
LigandPNGBDBM76794(5-nitro-2-thiophenecarboxylic acid [2-oxo-2-(1H-py...)
Affinity DataIC50:  1.02E+4nM. Assay description: Data Source: Sanford-Burnham Center for Chemical Genomics (SBCCG) Source Affiliation: Sanford-Burnham Medical Research Institute (SBMRI, San Diego, C...
In DepthDetails PCBioAssay
TargetMitochondrial peptide methionine sulfoxide reductase(Bos taurus)
The Scripps Research Institute Molecular Screening Center
Curated by PubChem BioAssay
LigandPNGBDBM76794(5-nitro-2-thiophenecarboxylic acid [2-oxo-2-(1H-py...)
Affinity DataEC50:  1.58E+4nM. Assay description: Source (MLPCN Center Name): The Scripps Research Institute Molecular Screening Center (SRIMSC) Affiliation: The Scripps Research Institute, TSRI Assa...
In DepthDetails PCBioAssay
TargetRecBCD enzyme subunit RecD(Escherichia coli str. K-12 substr. MG1655)
The Scripps Research Institute Molecular Screening Center
Curated by PubChem BioAssay
LigandPNGBDBM76794(5-nitro-2-thiophenecarboxylic acid [2-oxo-2-(1H-py...)
Affinity DataIC50: >1.19E+5nM. Assay description: Source (MLPCN Center Name): The Scripps Research Institute Molecular Screening Center (SRIMSC) Affiliation: The Scripps Research Institute, TSRI Assa...
In DepthDetails PCBioAssay
TargetSentrin-specific protease 8(Homo sapiens (Human))
Burnham Center For Chemical Genomics
Curated by PubChem BioAssay
LigandPNGBDBM76794(5-nitro-2-thiophenecarboxylic acid [2-oxo-2-(1H-py...)
Affinity DataIC50:  5.37E+3nM. Assay description: Data Source: Sanford-Burnham Center for Chemical Genomics (SBCCG) Source Affiliation: Sanford-Burnham Medical Research Institute (SBMRI, San Diego, C...
In DepthDetails PCBioAssay