BDBM76809 3-[(1-tert-amyltetrazol-5-yl)-[4-(2,3-dimethylphenyl)piperazino]methyl]benzonitrile::3-[[4-(2,3-dimethylphenyl)-1-piperazinyl]-[1-(2-methylbutan-2-yl)-5-tetrazolyl]methyl]benzonitrile::3-[[4-(2,3-dimethylphenyl)piperazin-1-yl]-[1-(2-methylbutan-2-yl)-1,2,3,4-tetrazol-5-yl]methyl]benzenecarbonitrile::3-[[4-(2,3-dimethylphenyl)piperazin-1-yl]-[1-(2-methylbutan-2-yl)tetrazol-5-yl]methyl]benzonitrile::3-{[4-(2,3-Dimethyl-phenyl)-piperazin-1-yl]-[1-(1,1-dimethyl-propyl)-1H-tetrazol-5-yl]-methyl}-benzonitrile::MLS000071108::SMR000008234::cid_646213
SMILES CCC(C)(C)n1nnnc1C(N1CCN(CC1)c1cccc(C)c1C)c1cccc(c1)C#N
InChI Key InChIKey=CZCLZULXSVVZRK-UHFFFAOYSA-N
Data  2 EC50
  Tab Delimited (TSV)   2D SDfile   Computed 3D by Vconf -m prep SDfile
Find this compound or compounds like it in BindingDB:
Activity Spreadsheet -- Enzyme Inhibition Constant Data from BindingDB
Found 2 hits for monomerid = 76809
TargetCorticotropin-releasing factor-binding protein(Homo sapiens (Human))
Burnham Center For Chemical Genomics
Curated by PubChem BioAssay
LigandPNGBDBM76809(3-[(1-tert-amyltetrazol-5-yl)-[4-(2,3-dimethylphen...)
Affinity DataEC50: >5.30E+4nM. Assay description: Data Source: Sanford-Burnham Center for Chemical Genomics (SBCCG) Source Affiliation: Sanford-Burnham Medical Research Institute (SBMRI, San Diego, C...
In DepthDetails PCBioAssay
TargetVoltage-dependent T-type calcium channel subunit alpha-1H(Homo sapiens (Human))
Vanderbilt Screening Center For Gpcrs, Ion Channels And Transporters
Curated by PubChem BioAssay
LigandPNGBDBM76809(3-[(1-tert-amyltetrazol-5-yl)-[4-(2,3-dimethylphen...)
Affinity DataEC50:  3.41E+3nM. Assay description: Assay Provider: Xinmin Xie Assay Provider Affiliation: Bioscience Division, SRI International, Menlo Park, CA Grant Title: HTS Assay for Cav3 T-Type ...
In DepthDetails PCBioAssay